Project

General

Profile

Bug #7855

Updated by Igor Kozhukhov over 5 years ago

build by gcc6 failed on intel with: 

 <pre> 
 ==== Build errors (DEBUG) ==== 

 ../../i86pc/os/trap.c:2192:5: error: 'stype' may be used uninitialized in this function [-Werror=maybe-uninitialized] 
 dmake: Fatal error: Command failed for target `debug64/trap.o' 
 </pre> 

 build by gcc44 failed on sparc with : 
 <pre> 
 ==== Build errors (DEBUG) ==== 

 ../../sun4u/cpu/spitfire.c:3260: error: '0' flag used with '%b' cmn_err format [-Wformat] 
 ../../sun4u/cpu/spitfire.c:3260: error: '0' flag used with '%b' cmn_err format [-Wformat] 
 ../../sun4u/cpu/spitfire.c:3297: error: '0' flag used with '%b' cmn_err format [-Wformat] 
 ../../sun4u/cpu/spitfire.c:3305: error: '0' flag used with '%b' cmn_err format [-Wformat] 
 dmake: Fatal error: Command failed for target `debug64/spitfire.o' 
 The following command caused the error: 
 dmake: Fatal error: Command failed for target `def.debug64' 
 The following command caused the error: 
 dmake: Fatal error: Command failed for target `install.debug64' 
 The following command caused the error: 
 dmake: Fatal error: Command failed for target `spitfire' 
 dmake: Fatal error: Command failed for target `sun4u' 
 dmake: Fatal error: Command failed for target `uts' 
 </pre>

Back